Reaction Details
TargetUbiquitin carboxyl-terminal hydrolase 1/WD repeat-containing protein 48
LigandBDBM351827
Substrate/Competitorn/a
Meas. Tech.Inhibition Assay
IC50 150±n/a nM
Citation Maloney, DJRosenthal, ASJadhav, ADexheimer, TSSimeonov, AZhuang, ZLiang, QLuci, DK Inhibitors of the USP1/UAF1 deubiquitinase complex and uses thereof US Patent US9802904 Publication Date 10/31/2017
 
Ubiquitin carboxyl-terminal hydrolase 1/WD repeat-containing protein 48
Name:Ubiquitin carboxyl-terminal hydrolase 1/WD repeat-containing protein 48
Type:Protein
Mol. Mass.:n/a
Description:n/a
Components:This complex has 2 components.
Component 1
Name:WD repeat-containing protein 48
Synonyms:KIAA1449 USP1-associated factor 1 WD repeat endosomal protein WDR48 p80
Type:PROTEIN
Mol. Mass.:76215.66
Organism:Homo sapiens (Human)
Description:ChEMBL_109642
Residue:677
Component 2
Name:Ubiquitin carboxyl-terminal hydrolase 1
Synonyms:Deubiquitinating enzyme 1 USP1 Ubiquitin thioesterase 1 hUBP
Type:PROTEIN
Mol. Mass.:88191.62
Organism:Homo sapiens (Human)
Description:ChEMBL_104169
Residue:785
BDBM351827
NameBDBM351827
Synonyms:US9802904, 63
TypeSmall organic molecule
Emp. Form.C28H30N4
Mol. Mass.422.5646
SMILESCC(C)c1ccccc1-c1ncc(N(C)C)c(NCc2ccc(cc2)-c2ccccc2)n1