Reaction Details
TargetBeta-secretase 2
LigandBDBM352246
Substrate/Competitorn/a
Meas. Tech.HTRF Assay
Ki 95.0±n/a nM
Citation Scott, JDCumming, JNBlizzard, TEllis, M C-6 spirocarbocyclic iminothiadiazine dioxides as BACE inhibitors, compositions, and their use US Patent US9802928 Publication Date 10/31/2017
 
Beta-secretase 2
Name:Beta-secretase 2
Type:Protein
Mol. Mass.:56171.20
Organism:Homo sapiens (Human)
Description:Q9Y5Z0
Residue:518
BDBM352246
NameBDBM352246
Synonyms:US9802928, 1c
TypeSmall organic molecule
Emp. Form.C22H22FN5O4S
Mol. Mass.471.505
SMILESCN1C(=N)N[C@](C)(c2cc(NC(=O)c3ccc(OCC#C)cn3)ccc2F)C2(CC2)S1(=O)=O