Reaction Details
TargetBeta-secretase 2
LigandBDBM352249
Substrate/Competitorn/a
Meas. Tech.HTRF Assay
Ki 55.0±n/a nM
Citation Scott, JDCumming, JNBlizzard, TEllis, M C-6 spirocarbocyclic iminothiadiazine dioxides as BACE inhibitors, compositions, and their use US Patent US9802928 Publication Date 10/31/2017
 
Beta-secretase 2
Name:Beta-secretase 2
Type:Protein
Mol. Mass.:56171.20
Organism:Homo sapiens (Human)
Description:Q9Y5Z0
Residue:518
BDBM352249
NameBDBM352249
Synonyms:US9802928, 1f
TypeSmall organic molecule
Emp. Form.C20H19F4N5O3S
Mol. Mass.485.455
SMILESCN1C(=N)N[C@](C)(c2cc(NC(=O)c3ccc(cn3)C(F)(F)F)ccc2F)C2(CC2)S1(=O)=O