Reaction Details
TargetBeta-secretase 1
LigandBDBM352265
Substrate/Competitorn/a
Meas. Tech.HTRF FRET Assay
Ki 25.0±n/a nM
Citation Scott, JDCumming, JNBlizzard, TEllis, M C-6 spirocarbocyclic iminothiadiazine dioxides as BACE inhibitors, compositions, and their use US Patent US9802928 Publication Date 10/31/2017
 
Beta-secretase 1
Name:Beta-secretase 1
Type:Protein
Mol. Mass.:55755.10
Organism:Homo sapiens (Human)
Description:P56817
Residue:501
BDBM352265
NameBDBM352265
Synonyms:US9802928, 1u
TypeSmall organic molecule
Emp. Form.C19H22FN5O4S
Mol. Mass.435.472
SMILESCN1C(=N)N[C@](C)(c2cc(NC(=O)c3nc(C)oc3C)ccc2F)C2(CC2)S1(=O)=O