Reaction Details
TargetBeta-secretase 2
LigandBDBM352265
Substrate/Competitorn/a
Meas. Tech.HTRF Assay
Ki 8.00±n/a nM
Citation Scott, JDCumming, JNBlizzard, TEllis, M C-6 spirocarbocyclic iminothiadiazine dioxides as BACE inhibitors, compositions, and their use US Patent US9802928 Publication Date 10/31/2017
 
Beta-secretase 2
Name:Beta-secretase 2
Type:Protein
Mol. Mass.:56171.20
Organism:Homo sapiens (Human)
Description:Q9Y5Z0
Residue:518
BDBM352265
NameBDBM352265
Synonyms:US9802928, 1u
TypeSmall organic molecule
Emp. Form.C19H22FN5O4S
Mol. Mass.435.472
SMILESCN1C(=N)N[C@](C)(c2cc(NC(=O)c3nc(C)oc3C)ccc2F)C2(CC2)S1(=O)=O