Reaction Details
TargetBeta-secretase 2
LigandBDBM352266
Substrate/Competitorn/a
Meas. Tech.HTRF Assay
Ki 63.0±n/a nM
Citation Scott, JDCumming, JNBlizzard, TEllis, M C-6 spirocarbocyclic iminothiadiazine dioxides as BACE inhibitors, compositions, and their use US Patent US9802928 Publication Date 10/31/2017
 
Beta-secretase 2
Name:Beta-secretase 2
Type:Protein
Mol. Mass.:56171.20
Organism:Homo sapiens (Human)
Description:Q9Y5Z0
Residue:518
BDBM352266
NameBDBM352266
Synonyms:US9802928, 1v
TypeSmall organic molecule
Emp. Form.C19H19FN6O3S2
Mol. Mass.462.521
SMILESCN1C(=N)N[C@](C)(c2cc(NC(=O)c3cn4ccsc4n3)ccc2F)C2(CC2)S1(=O)=O