Reaction Details
TargetProthrombin
LigandBDBM17087
Substrate/CompetitorBDBM12680
Meas. Tech.Enzyme Inhibition Assay
Ki 1300±n/a nM
Citation Ye, BArnaiz, DOChou, YLGriedel, BDKaranjawala, RLee, WMorrissey, MMSacchi, KLSakata, STShaw, KJWu, SCZhao, ZAdler, MCheeseman, SDole, WPEwing, JFitch, RLentz, DLiang, ALight, DMorser, JPost, JRumennik, GSubramanyam, BSullivan, MEVergona, RWalters, JWang, YXWhite, KAWhitlow, MKochanny, MJ Thiophene-anthranilamides as highly potent and orally available factor xa inhibitors J Med Chem50:2967-80 (2007) 
 
Prothrombin
Name:Prothrombin
Type:Protein
Mol. Mass.:70029.57
Organism:Homo sapiens (Human)
Description:P00734
Residue:622
BDBM17087
BDBM12680
NameBDBM17087
Synonyms:3-chloro-N-{4-chloro-2-[(4-chlorophenyl)carbamoyl]-6-methoxyphenyl}-4-[(4-methylpiperazin-1-yl)methyl]thiophene-2-carboxamide | Thiophene-Anthranilamide, 3b
TypeSmall organic molecule
Emp. Form.C25H25Cl3N4O3S
Mol. Mass.567.915
SMILESCOc1cc(Cl)cc(C(=O)Nc2ccc(Cl)cc2)c1NC(=O)c1scc(CN2CCN(C)CC2)c1Cl