Reaction Details
TargetProthrombin
LigandBDBM17114
Substrate/CompetitorBDBM12680
Meas. Tech.Enzyme Inhibition Assay
Ki 1700±n/a nM
Citation Ye, BArnaiz, DOChou, YLGriedel, BDKaranjawala, RLee, WMorrissey, MMSacchi, KLSakata, STShaw, KJWu, SCZhao, ZAdler, MCheeseman, SDole, WPEwing, JFitch, RLentz, DLiang, ALight, DMorser, JPost, JRumennik, GSubramanyam, BSullivan, MEVergona, RWalters, JWang, YXWhite, KAWhitlow, MKochanny, MJ Thiophene-anthranilamides as highly potent and orally available factor xa inhibitors J Med Chem50:2967-80 (2007) 
 
Prothrombin
Name:Prothrombin
Type:Protein
Mol. Mass.:70029.57
Organism:Homo sapiens (Human)
Description:P00734
Residue:622
BDBM17114
BDBM12680
NameBDBM17114
Synonyms:4-{[tert-butyl(4,5-dihydro-1,3-oxazol-2-yl)amino]methyl}-3-chloro-N-{4-chloro-2-[(5-chloropyridin-2-yl)carbamoyl]-6-methoxyphenyl}thiophene-2-carboxamide | Thiophene-Anthranilamide, 13d
TypeSmall organic molecule
Emp. Form.C26H26Cl3N5O4S
Mol. Mass.610.94
SMILESCOc1cc(Cl)cc(C(=O)Nc2ccc(Cl)cn2)c1NC(=O)c1scc(CN(C2=NCCO2)C(C)(C)C)c1Cl