Reaction Details
TargetMitogen-activated protein kinase kinase kinase 11
LigandBDBM50441571
Substrate/Competitorn/a
Meas. Tech.Radiometric Filter Plate Assay
IC50<100±n/a nM
Citation Gelbard, HADewhurst, SGoodfellow, VSLoweth, CJWiemann, T Substituted pyrrolo[2,3-b]pyridines as MLK inhibitors US Patent US9814704 Publication Date 11/14/2017
 
Mitogen-activated protein kinase kinase kinase 11
Name:Mitogen-activated protein kinase kinase kinase 11
Type:PROTEIN
Mol. Mass.:92696.93
Organism:Homo sapiens (Human)
Description:ChEMBL_1460565
Residue:847
BDBM50441571
NameBDBM50441571
Synonyms:CHEMBL2436982 US9814704, Example 18
TypeSmall organic molecule
Emp. Form.C21H20N4O3
Mol. Mass.376.4085
SMILESCOc1cc(cc(OC)c1OC)-c1cnc2[nH]cc(-c3ccc(N)nc3)c2c1