Reaction Details
TargetMitogen-activated protein kinase kinase kinase 11
LigandBDBM354757
Substrate/Competitorn/a
Meas. Tech.Radiometric Filter Plate Assay
IC50<100±n/a nM
Citation Gelbard, HADewhurst, SGoodfellow, VSLoweth, CJWiemann, T Substituted pyrrolo[2,3-b]pyridines as MLK inhibitors US Patent US9814704 Publication Date 11/14/2017
 
Mitogen-activated protein kinase kinase kinase 11
Name:Mitogen-activated protein kinase kinase kinase 11
Type:PROTEIN
Mol. Mass.:92696.93
Organism:Homo sapiens (Human)
Description:ChEMBL_1460565
Residue:847
BDBM354757
NameBDBM354757
Synonyms:US9814704, Example 34
TypeSmall organic molecule
Emp. Form.C35H35N5O4S
Mol. Mass.621.748
SMILESCOc1cc(ccc1OCCN1CCNCC1)-c1cnc2n(cc(-c3ccc4[nH]ccc4c3)c2c1)S(=O)(=O)c1ccc(C)cc1