Reaction Details
TargetMitogen-activated protein kinase kinase kinase 11
LigandBDBM354782
Substrate/Competitorn/a
Meas. Tech.Radiometric Filter Plate Assay
IC50<100±n/a nM
Citation Gelbard, HADewhurst, SGoodfellow, VSLoweth, CJWiemann, T Substituted pyrrolo[2,3-b]pyridines as MLK inhibitors US Patent US9814704 Publication Date 11/14/2017
 
Mitogen-activated protein kinase kinase kinase 11
Name:Mitogen-activated protein kinase kinase kinase 11
Type:PROTEIN
Mol. Mass.:92696.93
Organism:Homo sapiens (Human)
Description:ChEMBL_1460565
Residue:847
BDBM354782
NameBDBM354782
Synonyms:6-(3,5-difluoro-4- hydroxyphenyl)-1-(1H- indol-5-yl)-1H-imidazo[4,5- b]pyrazin-2(3H)-one US9814704, Example 59
TypeSmall organic molecule
Emp. Form.C19H11F2N5O2
Mol. Mass.379.3197
SMILESOc1c(F)cc(cc1F)-c1cnc2[nH]c(=O)n(-c3ccc4[nH]ccc4c3)c2n1