Reaction Details
TargetMitogen-activated protein kinase kinase kinase 11
LigandBDBM354888
Substrate/Competitorn/a
Meas. Tech.Radiometric Filter Plate Assay
IC50<100±n/a nM
Citation Gelbard, HADewhurst, SGoodfellow, VSLoweth, CJWiemann, T Substituted pyrrolo[2,3-b]pyridines as MLK inhibitors US Patent US9814704 Publication Date 11/14/2017
 
Mitogen-activated protein kinase kinase kinase 11
Name:Mitogen-activated protein kinase kinase kinase 11
Type:PROTEIN
Mol. Mass.:92696.93
Organism:Homo sapiens (Human)
Description:ChEMBL_1460565
Residue:847
BDBM354888
NameBDBM354888
Synonyms:Preparation of N-methyl-4-{5-[4-(4-methyl-piperazin-1-ylmethyl)-phenyl]-1H-pyrrolo[2,3-b]pyridin-3-yl}-benzamide US9814704, Example 165
TypeSmall organic molecule
Emp. Form.C27H29N5O
Mol. Mass.439.5521
SMILESCNC(=O)c1ccc(cc1)-c1c[nH]c2ncc(cc12)-c1ccc(CN2CCN(C)CC2)cc1