Reaction Details
TargetIntegrin alpha-4/beta-1 [T112H]
LigandBDBM17181
Substrate/CompetitorBDBM17155
Meas. Tech.Jurkat J6 Scintillation Proximity Assay
Ki 2.51±n/a nM
Citation Witherington, JBlaney, ELBordas, VElliott, RLGaiba, AGarton, NGreen, PMNaylor, ASmith, DGSpalding, DJTakle, AKWard, RW Pyridone derivatives as potent, orally bioavailable VLA-4 integrin antagonists. Bioorg Med Chem Lett16:5538-41 (2006) 
 
Integrin alpha-4/beta-1 [T112H]
Name:Integrin alpha-4/beta-1 [T112H]
Type:Protein Complex
Mol. Mass.:n/a
Description:The assay uses transfected Ramos cells expressing alpha4beta1 integrin.
Components:This complex has 2 components.
Component 1
Name:Integrin alpha-4
Synonyms:CD49 antigen-like family member D CD49d antigen ITA4_HUMAN Integrin alpha-4 Integrin alpha-IV VLA-4 integrin alpha 4 precursor | integrin alpha-4 precursor
Type:Membrane Protein
Mol. Mass.:114897.35
Organism:Homo sapiens (Human)
Description:P13612
Residue:1032
Component 2
Name:Integrin beta-1 [T112H]
Synonyms:CD29 antigen Fibronectin receptor subunit beta ITGB1 Integrin beta1 MSK12
Type:Membrane Protein
Mol. Mass.:88450.95
Organism:Homo sapiens (Human)
Description:P05556[T112H]
Residue:798
BDBM17181
BDBM17155
NameBDBM17181
Synonyms:(3S)-3-(4-{[3-(3-methyl-4-{[(2-methylphenyl)carbamoyl]amino}phenyl)-2-oxo-1,2-dihydropyridin-1-yl]methyl}phenyl)butanoic acid | Pyridone derivative, 27
TypeSmall organic molecule
Emp. Form.C31H31N3O4
Mol. Mass.509.5955
SMILESC[C@@H](CC(O)=O)c1ccc(Cn2cccc(-c3ccc(NC(=O)Nc4ccccc4C)c(C)c3)c2=O)cc1