Reaction Details
TargetCoagulation factor X
LigandBDBM17242
Substrate/CompetitorBDBM12658
Meas. Tech.Enzyme Inhibition Assay
Ki 1.9±n/a nM
Citation Kochanny, MJAdler, MEwing, JGriedel, BDHo, EKaranjawala, RLee, WLentz, DLiang, AMMorrissey, MMPhillips, GBPost, JSacchi, KLSakata, STSubramanyam, BVergona, RWalters, JWhite, KAWhitlow, MYe, BZhao, ZShaw, KJ Substituted thiophene-anthranilamides as potent inhibitors of human factor Xa. Bioorg Med Chem15:2127-46 (2007) 
 
Coagulation factor X
Name:Coagulation factor X
Type:Enzyme
Mol. Mass.:54726.60
Organism:Homo sapiens (Human)
Description:n/a
Residue:488
BDBM17242
BDBM12658
NameBDBM17242
Synonyms:3-chloro-N-{4-chloro-2-[(4-chlorophenyl)carbamoyl]phenyl}-4-(1H-imidazol-1-ylmethyl)thiophene-2-carboxamide | thiophene-containing non-amidine inhibitor, 35
TypeSmall organic molecule
Emp. Form.C22H15Cl3N4O2S
Mol. Mass.505.804
SMILESClc1c(Cn2ccnc2)csc1C(=O)Nc1ccc(Cl)cc1C(=O)Nc1ccc(Cl)cc1