Reaction Details
TargetBeta-secretase 1
LigandBDBM228168
Substrate/Competitorn/a
Meas. Tech.BACE1 Binding Assay
pH4.5±n/a
Temperature298.15±n/a K
Ki 6.90±n/a nM
Commentsextracted
Citation Juhl, KTagmose, LMarigo, M 2-amino-6-(difluoromethyl)-5,5-difluoro-6-phenyl-3,4,5,6-tetrahydropyridines as BACE1 inhibitors US Patent US10045974 Publication Date 8/14/2018
 
Beta-secretase 1
Name:Beta-secretase 1
Type:Protein
Mol. Mass.:55755.10
Organism:Homo sapiens (Human)
Description:P56817
Residue:501
BDBM228168
NameBDBM228168
Synonyms:(S)-N-(3-(6-amino-2-(difluoromethyl)-3,3-difluoro-2,3,4,5-tetrahydropyridin-2-yl)-4-fluorophenyl)-5-methoxypyrimidine-2-carboxamide (Compound 9) US10603310, Compound 9
TypeSmall organic molecule
Emp. Form.C18H16F5N5O2
Mol. Mass.429.344
SMILESCOc1cnc(nc1)C(=O)Nc1ccc(F)c(c1)[C@]1(N=C(N)CCC1(F)F)C(F)F