Reaction Details
TargetMucosa-associated lymphoid tissue lymphoma translocation protein 1
LigandBDBM355881
Substrate/Competitorn/a
Meas. Tech.Biochemical Assay
IC50 0.005±n/a nM
Citation Soldermann, CPQuancard, JSchlapbach, ASimic, OTintelnot-Blomley, MZoller, T Pyrazolo pyrimidine derivatives and their use as MALT1 inhibitors US Patent US9815842 Publication Date 11/14/2017
 
Mucosa-associated lymphoid tissue lymphoma translocation protein 1
Name:Mucosa-associated lymphoid tissue lymphoma translocation protein 1
Type:Enzyme
Mol. Mass.:92257.81
Organism:Homo sapiens (Human)
Description:Q9UDY8
Residue:824
BDBM355881
NameBDBM355881
Synonyms:(R)-1-(5-chloro-6-(2H-1,2,3-triazol-2-yl)pyridin-3-yl)-3-(2-chloro-7-(1-methoxy-2-methylpropyl)pyrazolo[1,5-a]pyrimidin-6-yl)urea US9815842, Example 5
TypeSmall organic molecule
Emp. Form.C19H19Cl2N9O2
Mol. Mass.476.319
SMILESCO[C@H](C(C)C)c1c(NC(=O)Nc2cnc(c(Cl)c2)-n2nccn2)cnc2cc(Cl)nn12