Reaction Details
TargetMucosa-associated lymphoid tissue lymphoma translocation protein 1
LigandBDBM355901
Substrate/Competitorn/a
Meas. Tech.Biochemical Assay
IC50 0.005±n/a nM
Citation Soldermann, CPQuancard, JSchlapbach, ASimic, OTintelnot-Blomley, MZoller, T Pyrazolo pyrimidine derivatives and their use as MALT1 inhibitors US Patent US9815842 Publication Date 11/14/2017
 
Mucosa-associated lymphoid tissue lymphoma translocation protein 1
Name:Mucosa-associated lymphoid tissue lymphoma translocation protein 1
Type:Enzyme
Mol. Mass.:92257.81
Organism:Homo sapiens (Human)
Description:Q9UDY8
Residue:824
BDBM355901
NameBDBM355901
Synonyms:1-(5-chloro-6- ethoxypyridin-3-yl)- 3-(2-chloro-7- isopropylpyrazolo[1, 5-a]pyrimidin-6- yl)urea US9815842, Example 25
TypeSmall organic molecule
Emp. Form.C17H18Cl2N6O2
Mol. Mass.409.27
SMILESCCOc1ncc(NC(=O)Nc2cnc3cc(Cl)nn3c2C(C)C)cc1Cl