Reaction Details
TargetMucosa-associated lymphoid tissue lymphoma translocation protein 1
LigandBDBM355914
Substrate/Competitorn/a
Meas. Tech.Biochemical Assay
IC50 0.005±n/a nM
Citation Soldermann, CPQuancard, JSchlapbach, ASimic, OTintelnot-Blomley, MZoller, T Pyrazolo pyrimidine derivatives and their use as MALT1 inhibitors US Patent US9815842 Publication Date 11/14/2017
 
Mucosa-associated lymphoid tissue lymphoma translocation protein 1
Name:Mucosa-associated lymphoid tissue lymphoma translocation protein 1
Type:Enzyme
Mol. Mass.:92257.81
Organism:Homo sapiens (Human)
Description:Q9UDY8
Residue:824
BDBM355914
NameBDBM355914
Synonyms:1-(5-chloro-6-(2H- 1,2,3-triazol-2- yl)pyridin-3-yl)-3-(2- chloro-7- cyclobutylpyrazolo[1, 5-a]pyrimidin-6- yl)urea US9815842, Example 38
TypeSmall organic molecule
Emp. Form.C18H15Cl2N9O
Mol. Mass.444.277
SMILESClc1cc2ncc(NC(=O)Nc3cnc(c(Cl)c3)-n3nccn3)c(C3CCC3)n2n1