Reaction Details
TargetMucosa-associated lymphoid tissue lymphoma translocation protein 1
LigandBDBM355948
Substrate/Competitorn/a
Meas. Tech.Biochemical Assay
IC50 0.003±n/a nM
Citation Soldermann, CPQuancard, JSchlapbach, ASimic, OTintelnot-Blomley, MZoller, T Pyrazolo pyrimidine derivatives and their use as MALT1 inhibitors US Patent US9815842 Publication Date 11/14/2017
 
Mucosa-associated lymphoid tissue lymphoma translocation protein 1
Name:Mucosa-associated lymphoid tissue lymphoma translocation protein 1
Type:Enzyme
Mol. Mass.:92257.81
Organism:Homo sapiens (Human)
Description:Q9UDY8
Residue:824
BDBM355948
NameBDBM355948
Synonyms:1-(5-chloro-6-(2H- 1,2,3-triazol-2- yl)pyridin-3-yl)-3-(2- methyl-7-(1- methylcyclopropyl) pyrazolo[1,5- a]pyrimidin-6-yl)urea US9815842, Example 72
TypeSmall organic molecule
Emp. Form.C19H18ClN9O
Mol. Mass.423.859
SMILESCc1cc2ncc(NC(=O)Nc3cnc(c(Cl)c3)-n3nccn3)c(n2n1)C1(C)CC1