Reaction Details
TargetMucosa-associated lymphoid tissue lymphoma translocation protein 1
LigandBDBM355951
Substrate/Competitorn/a
Meas. Tech.Biochemical Assay
IC50 0.005±n/a nM
Citation Soldermann, CPQuancard, JSchlapbach, ASimic, OTintelnot-Blomley, MZoller, T Pyrazolo pyrimidine derivatives and their use as MALT1 inhibitors US Patent US9815842 Publication Date 11/14/2017
 
Mucosa-associated lymphoid tissue lymphoma translocation protein 1
Name:Mucosa-associated lymphoid tissue lymphoma translocation protein 1
Type:Enzyme
Mol. Mass.:92257.81
Organism:Homo sapiens (Human)
Description:Q9UDY8
Residue:824
BDBM355951
NameBDBM355951
Synonyms:(S)-1-(2-chloro-7-(1- methoxy-2- methylpropyl)pyra- zolo[1,5-a]pyrimidin- 6-yl)-3-(2- (trifluoromethyl)pyri- din-4-yl)urea US9815842, Example 75
TypeSmall organic molecule
Emp. Form.C18H18ClF3N6O2
Mol. Mass.442.823
SMILESCO[C@@H](C(C)C)c1c(NC(=O)Nc2ccnc(c2)C(F)(F)F)cnc2cc(Cl)nn12