Reaction Details
TargetMucosa-associated lymphoid tissue lymphoma translocation protein 1
LigandBDBM355979
Substrate/Competitorn/a
Meas. Tech.Biochemical Assay
IC50 0.005±n/a nM
Citation Soldermann, CPQuancard, JSchlapbach, ASimic, OTintelnot-Blomley, MZoller, T Pyrazolo pyrimidine derivatives and their use as MALT1 inhibitors US Patent US9815842 Publication Date 11/14/2017
 
Mucosa-associated lymphoid tissue lymphoma translocation protein 1
Name:Mucosa-associated lymphoid tissue lymphoma translocation protein 1
Type:Enzyme
Mol. Mass.:92257.81
Organism:Homo sapiens (Human)
Description:Q9UDY8
Residue:824
BDBM355979
NameBDBM355979
Synonyms:1-(5-chloro-6-(2H- 1,2,3-triazol-2- yl)pyridin-3-yl)-3-(2- chloro-7-((S)-1-(((R)- tetrahydrofuran-3- yl)methoxy)ethyl)pyra- zolo[1,5- a]pyrimidin-6-yl)urea US9815842, Example 103
TypeSmall organic molecule
Emp. Form.C21H21Cl2N9O3
Mol. Mass.518.356
SMILESC[C@H](OC[C@@H]1CCOC1)c1c(NC(=O)Nc2cnc(c(Cl)c2)-n2nccn2)cnc2cc(Cl)nn12