Reaction Details
TargetE3 ubiquitin-protein ligase XIAP [241-356]
LigandBDBM17344
Substrate/CompetitorBDBM17342
Meas. Tech.Fluorescence Polarization Affinity Measurements.
pH7.2±n/a
Temperature295.15±n/a K
Ki 50±n/a nM
Citation Zobel, KWang, LVarfolomeev, EFranklin, MCElliott, LOWallweber, HJOkawa, DCFlygare, JAVucic, DFairbrother, WJDeshayes, K Design, synthesis, and biological activity of a potent Smac mimetic that sensitizes cancer cells to apoptosis by antagonizing IAPs. ACS Chem Biol1:525-33 (2006) 
 
E3 ubiquitin-protein ligase XIAP [241-356]
Name:E3 ubiquitin-protein ligase XIAP [241-356]
Type:Protein Binding Domain
Mol. Mass.:13276.62
Organism:Homo sapiens (Human)
Description:BIR3 of XIAP: RESIDUES 241-356.
Residue:116
BDBM17344
BDBM17342
NameBDBM17344
Synonyms:(2S)-2-{[(2S)-1-[(2S)-2-[(2S)-2-aminopropanamido]-3-methylbutanoyl]pyrrolidin-2-yl]formamido}-3-(1H-indol-3-yl)propanoic acid L-alanyl-L-valyl-L-prolyl-L-tryptophan
TypePolypeptide
Emp. Form.C24H33N5O5
Mol. Mass.471.5493
SMILESCC(C)[C@H](NC(=O)[C@H](C)N)C(=O)N1CCC[C@H]1C(=O)N[C@@H](Cc1c[nH]c2ccccc12)C(O)=O