Reaction Details
TargetC-C chemokine receptor type 3
LigandBDBM123076
Substrate/Competitorn/a
Meas. Tech.Assay in WO 2010 115836
Ki 3.50±n/a nM
Citation Fetscher, AScher, JM Pharmaceutical formulations comprising CCR3 antagonists US Patent US10213421 Publication Date 2/26/2019
 
C-C chemokine receptor type 3
Name:C-C chemokine receptor type 3
Type:Enzyme
Mol. Mass.:41053.88
Organism:Homo sapiens (Human)
Description:P51677
Residue:355
BDBM123076
NameBDBM123076
Synonyms:US10213421, Example 3 US8742115, 15
TypeSmall organic molecule
Emp. Form.C29H36ClN5O3
Mol. Mass.538.081
SMILESCc1cc(cc(NC(=O)[C@H]2CCC(=O)N2C2CCN(Cc3ccc(Cl)c(C)c3)CC2)n1)C(=O)NCC1CC1