Reaction Details
TargetApoptosis regulator Bcl-2
LigandBDBM189515
Substrate/Competitorn/a
Meas. Tech.TR-FRET (Time-Resolved Fluorescence-Resonance-Energy-Transfer) assay
Ki<0.010±n/a nM
Citation Catron, NLindley, DMiller, JMSchmitt, EATong, P Solid dispersions containing an apoptosis-inducing agent US Patent US10213433 Publication Date 2/26/2019
 
Apoptosis regulator Bcl-2
Name:Apoptosis regulator Bcl-2
Type:Homodimer or heterodimer
Mol. Mass.:26269.11
Organism:Homo sapiens (Human)
Description:P10415
Residue:239
BDBM189515
NameBDBM189515
Synonyms:US10213433, Compound 67 US20240043404, Example 67 | US9174982, 67
TypeSmall organic molecule
Emp. Form.C43H48ClN9O7S
Mol. Mass.870.415
SMILESCN1CCN(CC1)Nc1ccc(cc1[N+]([O-])=O)S(=O)(=O)NC(=O)c1ccc(cc1Oc1cnc2[nH]ccc2c1)N1CCN(CC2=C(CC(C)(C)OC2)c2ccc(Cl)cc2)CC1