Reaction Details
TargetApoptosis regulator Bcl-2
LigandBDBM356985
Substrate/Competitorn/a
Meas. Tech.TR-FRET (Time-Resolved Fluorescence-Resonance-Energy-Transfer) assay
Ki<0.001±n/a nM
Citation Catron, NLindley, DMiller, JMSchmitt, EATong, P Solid dispersions containing an apoptosis-inducing agent US Patent US10213433 Publication Date 2/26/2019
 
Apoptosis regulator Bcl-2
Name:Apoptosis regulator Bcl-2
Type:Homodimer or heterodimer
Mol. Mass.:26269.11
Organism:Homo sapiens (Human)
Description:P10415
Residue:239
BDBM356985
NameBDBM356985
Synonyms:4-(4-{[2-(4-chlorophenyl)-4,4-dimethylcyclohex-1-en-1-yl]methyl}piperazin-1-yl)-N-[(6-{[(trans-4-hydroxy-4-methylcyclohexyl)methyl]amino}-5-nitropyridin-3-yl)sulfonyl]-2-(1H-pyrrolo[2,3-b]pyridin-5-yloxy)benzamide US20240043404, Example 371
TypeSmall organic molecule
Emp. Form.C46H53ClN8O7S
Mol. Mass.897.48
SMILESCC1(C)CCC(CN2CCN(CC2)c2ccc(C(=O)NS(=O)(=O)c3cnc(NC[C@H]4CC[C@@](C)(O)CC4)c(c3)[N+]([O-])=O)c(Oc3cnc4[nH]ccc4c3)c2)=C(C1)c1ccc(Cl)cc1