Reaction Details
TargetMonocarboxylate transporter 4
LigandBDBM345264
Substrate/Competitorn/a
Meas. Tech.MCT4-Mediated Lactate Transport in NCI-H358 Lung Adenocarcinoma Cell
IC50 33.0±n/a nM
Citation Parnell, KMMcCall, JRomero, D Heterocyclic inhibitors of MCT4 US Patent US10214492 Publication Date 2/26/2019
 
Monocarboxylate transporter 4
Name:Monocarboxylate transporter 4
Type:PROTEIN
Mol. Mass.:49474.36
Organism:Homo sapiens (Human)
Description:ChEMBL_104604
Residue:465
BDBM345264
NameBDBM345264
Synonyms:2-[[5-(3-Chlorophenyl)-1-[(2- chlorophenyl)methyl]pyrazol-3- yl]methoxy]-2-methyl-propanoic acid 1H NMR (CD3OD, 400 MHz) $#948; 1.32 (S, 6h) 4.58 (s, 2H), 5.42 (s, 2H), 6.57 (s, 1H), 6.67-6.80 (m, 1H), 7.22-7.30 (m, 3H), 7.32-42 (m, 4H). US10214492, Example 10 US11724989, Example 10
TypeSmall organic molecule
Emp. Form.C21H20Cl2N2O3
Mol. Mass.419.301
SMILESCC(C)(OCc1cc(-c2cccc(Cl)c2)n(Cc2ccccc2Cl)n1)C(O)=O