Reaction Details
TargetInhibitor of nuclear factor kappa-B kinase subunit epsilon
LigandBDBM357013
Substrate/Competitorn/a
Meas. Tech.Caliper Kinase Assay
IC50 50000±n/a nM
Citation Lloyd, JFinlay, HGunaga, PBanerjee, AAdisechan, A Quinazolines as potassium ion channel inhibitors US Patent US10214511 Publication Date 2/26/2019
 
Inhibitor of nuclear factor kappa-B kinase subunit epsilon
Name:Inhibitor of nuclear factor kappa-B kinase subunit epsilon
Type:Serine/threonine-protein kinase
Mol. Mass.:80475.98
Organism:Homo sapiens (Human)
Description:Kinase inhibitory activity was determined using recombinant human IKK-epsilon expressed in baculovirus as a FLAG-tagged fusion protein.
Residue:716
BDBM357013
NameBDBM357013
Synonyms:5-Phenyl-N-(pyridin-2-ylmethyl)-2-(pyrimidin-5-yl)quinazolin-4-amine | US10214511, Example 1
TypeSmall organic molecule
Emp. Form.C42H30N10O
Mol. Mass.690.754
SMILESOc1nc(nc2cccc(-c3ccccc3)c12)-c1cncnc1.C(Nc1nc(nc2cccc(-c3ccccc3)c12)-c1cncnc1)c1ccccn1