Reaction Details
TargetCarbonic anhydrase 9
LigandBDBM50387119
Substrate/Competitorn/a
Ki 67±n/a nM
Citation Sethi, KKVerma, SM A systematic quantitative approach to rational drug design and discovery of novel human carbonic anhydrase IX inhibitors. J Enzyme Inhib Med Chem29:571-81 (2014) 
 
Carbonic anhydrase 9
Name:Carbonic anhydrase 9
Type:Enzyme
Mol. Mass.:49669.03
Organism:Homo sapiens (Human)
Description:Catalytic domain of human cloned isozyme was used in the assay
Residue:459
BDBM50387119
NameBDBM50387119
Synonyms:4-ureidophenyl sulfamate ring derivative 3an | CHEMBL2047832
TypeSmall organic molecule
Emp. Form.C16H19N3O4S
Mol. Mass.349.405
SMILESCC(C)c1ccccc1NC(=O)Nc1ccc(OS(N)(=O)=O)cc1