Reaction Details
TargetCarbonic anhydrase 9
LigandBDBM50387155
Substrate/Competitorn/a
Ki 7.0±n/a nM
Citation Sethi, KKVerma, SM A systematic quantitative approach to rational drug design and discovery of novel human carbonic anhydrase IX inhibitors. J Enzyme Inhib Med Chem29:571-81 (2014) 
 
Carbonic anhydrase 9
Name:Carbonic anhydrase 9
Type:Enzyme
Mol. Mass.:49669.03
Organism:Homo sapiens (Human)
Description:Catalytic domain of human cloned isozyme was used in the assay
Residue:459
BDBM50387155
NameBDBM50387155
Synonyms:4-ureidophenyl sulfamate ring derivative 3as | CHEMBL2047837
TypeSmall organic molecule
Emp. Form.C15H15N3O5S
Mol. Mass.349.362
SMILESNS(=O)(=O)Oc1ccc(NC(=O)Nc2ccc3OCCc3c2)cc1