Reaction Details
TargetLysine-specific histone demethylase 1A
LigandBDBM151624
Substrate/Competitorn/a
Meas. Tech.LSD1 Histone Demethylase Assay
IC50 49±n/a nM
Citation Vankayalapati, HSorna, VWarner, SLStephens, BBearss, DJSharma, S Substituted (E)-N′-(1-phenylethylidene)benzohydrazide analogs as histone demethylase inhibitors US Patent US9555024 Publication Date 1/31/2017
 
Lysine-specific histone demethylase 1A
Name:Lysine-specific histone demethylase 1A
Type:Enzyme
Mol. Mass.:92901.01
Organism:Homo sapiens (Human)
Description:O60341
Residue:852
BDBM151624
NameBDBM151624
Synonyms:US8987335, 25
TypeSmall organic molecule
Emp. Form.C16H15ClN2O4S
Mol. Mass.366.819
SMILESC\C(=N/NC(=O)c1cccc(c1)S(C)(=O)=O)c1cc(Cl)ccc1O