Reaction Details
TargetAmine oxidase [flavin-containing] A
LigandBDBM151625
Substrate/Competitorn/a
Meas. Tech.Monoamine Oxidase (MAO) Assay
IC50 2100±n/a nM
Citation Vankayalapati, HSorna, VWarner, SLStephens, BBearss, DJSharma, S Substituted (E)-N′-(1-phenylethylidene)benzohydrazide analogs as histone demethylase inhibitors US Patent US9555024 Publication Date 1/31/2017
 
Amine oxidase [flavin-containing] A
Name:Amine oxidase [flavin-containing] A
Type:Protein
Mol. Mass.:59689.53
Organism:Homo sapiens (Human)
Description:P21397
Residue:527
BDBM151625
NameBDBM151625
Synonyms:US8987335, --
TypeSmall organic molecule
Emp. Form.C9H11N
Mol. Mass.133.1903
SMILESN[C@@H]1CC1c1ccccc1