Reaction Details
TargetLysine-specific histone demethylase 1A
LigandBDBM151606
Substrate/Competitorn/a
Meas. Tech.LSD1 Histone Demethylase Assay
IC50 291±n/a nM
Citation Vankayalapati, HSorna, VWarner, SLStephens, BBearss, DJSharma, S Substituted (E)-N′-(1-phenylethylidene)benzohydrazide analogs as histone demethylase inhibitors US Patent US9555024 Publication Date 1/31/2017
 
Lysine-specific histone demethylase 1A
Name:Lysine-specific histone demethylase 1A
Type:Enzyme
Mol. Mass.:92901.01
Organism:Homo sapiens (Human)
Description:O60341
Residue:852
BDBM151606
NameBDBM151606
Synonyms:US8987335, 3 | US9555024, 3
TypeSmall organic molecule
Emp. Form.C15H14N2O3
Mol. Mass.270.2833
SMILESC\C(=N/NC(=O)c1ccc(O)cc1)c1ccccc1O