Reaction Details
TargetDihydrofolate reductase
LigandBDBM18043
Substrate/CompetitorBDBM18044
Meas. Tech.Enzyme Inhibition Assay
pH6.4±n/a
Temperature303.15±n/a K
IC50 4±n/a nM
Citation Whitlow, MHoward, AJStewart, DHardman, KDChan, JHBaccanari, DPTansik, RLHong, JSKuyper, LF X-Ray crystal structures of Candida albicans dihydrofolate reductase: high resolution ternary complexes in which the dihydronicotinamide moiety of NADPH is displaced by an inhibitor. J Med Chem44:2928-32 (2001) 
 
Dihydrofolate reductase
Name:Dihydrofolate reductase
Type:Enzyme
Mol. Mass.:22141.77
Organism:Candida albicans
Description:C. albicans DHFR was expressed in E. coli BL21, and purified to homogeneity.
Residue:192
BDBM18043
BDBM18044
NameBDBM18043
Synonyms:1,3-DIAMINO-7-(1-ETHYEPROPYE)-7H-PYRRALO-[3,2-F]QUINAZOLINE CHEMBL318721 | GW345
TypeSmall organic molecule
Emp. Form.C15H19N5
Mol. Mass.269.3449
SMILESCCC(CC)n1ccc2c1ccc1nc(N)nc(N)c21