Reaction Details
TargetDihydrofolate reductase
LigandBDBM18067
Substrate/CompetitorBDBM18044
Meas. Tech.Determination of IC50 Values
pH7±n/a
Temperature303.15±n/a K
IC50 75±6 nM
Citation Summerfield, RLDaigle, DMMayer, SMallik, DHughes, DWJackson, SGSulek, MOrgan, MGBrown, EDJunop, MS A 2.13 A structure of E. coli dihydrofolate reductase bound to a novel competitive inhibitor reveals a new binding surface involving the M20 loop region. J Med Chem49:6977-86 (2006) 
 
Dihydrofolate reductase
Name:Dihydrofolate reductase
Type:Enzyme
Mol. Mass.:17991.61
Organism:Escherichia coli
Description:E. coli DHFR was expressed in BL21, and purified to homogeneity.
Residue:159
BDBM18067
BDBM18044
NameBDBM18067
Synonyms:3-({[(3-{[(carbamimidamidomethanimidoyl)sulfanyl]methyl}phenyl)methyl]sulfanyl}methanimidoyl)guanidine | amidinothiouronium, 22
TypeSmall organic molecule
Emp. Form.C12H18N8S2
Mol. Mass.338.455
SMILESNC(=N)NC(=N)SCc1cccc(CSC(=N)NC(N)=N)c1