Reaction Details
TargetNeuronal acetylcholine receptor subunit alpha-7
LigandBDBM165922
Substrate/Competitorn/a
Meas. Tech.The [3H]-methyllycaconitine binding assay
Ki 24.0±n/a nM
Citation Luithle, JBöβ, FErb, CHafner, FSchnizler, KFlessner, TVan Kampen, MVan Der Staay, F 2-heteroaryl carboxamides US Patent US10214524 Publication Date 2/26/2019
 
Neuronal acetylcholine receptor subunit alpha-7
Name:Neuronal acetylcholine receptor subunit alpha-7
Type:Enzyme
Mol. Mass.:56502.44
Organism:Rattus norvegicus (Rat)
Description:Q05941
Residue:502
BDBM165922
NameBDBM165922
Synonyms:US10214524, Example 4 | US9067931, 4
TypeSmall organic molecule
Emp. Form.C26H29N3O3
Mol. Mass.431.5268
SMILESO=C(N[C@H]1CN2CCC1CC2)c1cc2ccc(cc2o1)-c1ccc(cc1)N1CCOCC1