Reaction Details
TargetNeuronal acetylcholine receptor subunit alpha-7
LigandBDBM165925
Substrate/Competitorn/a
Meas. Tech.The [3H]-methyllycaconitine binding assay
Ki 1.60±n/a nM
Citation Luithle, JBöβ, FErb, CHafner, FSchnizler, KFlessner, TVan Kampen, MVan Der Staay, F 2-heteroaryl carboxamides US Patent US10214524 Publication Date 2/26/2019
 
Neuronal acetylcholine receptor subunit alpha-7
Name:Neuronal acetylcholine receptor subunit alpha-7
Type:Enzyme
Mol. Mass.:56502.44
Organism:Rattus norvegicus (Rat)
Description:Q05941
Residue:502
BDBM165925
NameBDBM165925
Synonyms:US10214524, Example 20 | US9067931, 20
TypeSmall organic molecule
Emp. Form.C23H24N2O2S
Mol. Mass.392.514
SMILESOCc1ccc(cc1)-c1cccc2cc(sc12)C(=O)N[C@H]1CN2CCC1CC2