Reaction Details
TargetNeuronal acetylcholine receptor subunit alpha-7
LigandBDBM165927
Substrate/Competitorn/a
Meas. Tech.The [3H]-methyllycaconitine binding assay
Ki<0.100±n/a nM
Citation Luithle, JBöβ, FErb, CHafner, FSchnizler, KFlessner, TVan Kampen, MVan Der Staay, F 2-heteroaryl carboxamides US Patent US10214524 Publication Date 2/26/2019
 
Neuronal acetylcholine receptor subunit alpha-7
Name:Neuronal acetylcholine receptor subunit alpha-7
Type:Enzyme
Mol. Mass.:56502.44
Organism:Rattus norvegicus (Rat)
Description:Q05941
Residue:502
BDBM165927
NameBDBM165927
Synonyms:US10214524, Example 75 | US9067931, 75
TypeSmall organic molecule
Emp. Form.C23H22N2O3S
Mol. Mass.406.497
SMILESOC(=O)c1cccc(c1)-c1cccc2cc(sc12)C(=O)N[C@H]1CN2CCC1CC2