Reaction Details
TargetNeuronal acetylcholine receptor subunit alpha-7
LigandBDBM165929
Substrate/Competitorn/a
Meas. Tech.The [3H]-methyllycaconitine binding assay
Ki 14.0±n/a nM
Citation Luithle, JBöβ, FErb, CHafner, FSchnizler, KFlessner, TVan Kampen, MVan Der Staay, F 2-heteroaryl carboxamides US Patent US10214524 Publication Date 2/26/2019
 
Neuronal acetylcholine receptor subunit alpha-7
Name:Neuronal acetylcholine receptor subunit alpha-7
Type:Enzyme
Mol. Mass.:56502.44
Organism:Rattus norvegicus (Rat)
Description:Q05941
Residue:502
BDBM165929
NameBDBM165929
Synonyms:US10214524, Example 90 | US9067931, 90
TypeSmall organic molecule
Emp. Form.C26H27N3O4
Mol. Mass.445.5103
SMILESO=C(N[C@H]1CN2CCC1CC2)c1cc2cccc(-c3ccc(cc3)N3CCOCC3=O)c2o1