Reaction Details
TargetDihydrofolate reductase
LigandBDBM18245
Substrate/CompetitorBDBM18044
Meas. Tech.Dihydrofolate Reductase (DHFR) Assay
IC50 210±n/a nM
EC50 190±n/a nM
Citation Gangjee, AZeng, YTalreja, TMcGuire, JJKisliuk, RLQueener, SF Design and Synthesis of Classical and Nonclassical 6-Arylthio-2,4-diamino-5-ethylpyrrolo[2,3-d]pyrimidines as Antifolates. J Med Chem50:3046-3053 (2007) 
 
Dihydrofolate reductase
Name:Dihydrofolate reductase
Type:Enzyme
Mol. Mass.:21453.99
Organism:Homo sapiens (Human)
Description:Recombinant human DHFR.
Residue:187
BDBM18245
BDBM18044
NameBDBM18245
Synonyms:(2S)-2-{[4-({2,4-diamino-5-methyl-7H-pyrrolo[2,3-d]pyrimidin-6-yl}sulfanyl)phenyl]formamido}pentanedioic acid Pyrrolo[2, 3-d]pyrimidine analogue, 1a
TypeSmall organic molecule
Emp. Form.C19H20N6O5S
Mol. Mass.444.464
SMILESCc1c(Sc2ccc(cc2)C(=O)N[C@@H](CCC(O)=O)C(O)=O)[nH]c2nc(N)nc(N)c12