Reaction Details
TargetDihydrofolate reductase
LigandBDBM18268
Substrate/CompetitorBDBM18044
Meas. Tech.Dihydrofolate Reductase (DHFR) Assay
IC50 3±n/a nM
Citation Gangjee, AZeng, YTalreja, TMcGuire, JJKisliuk, RLQueener, SF Design and Synthesis of Classical and Nonclassical 6-Arylthio-2,4-diamino-5-ethylpyrrolo[2,3-d]pyrimidines as Antifolates. J Med Chem50:3046-3053 (2007) 
 
Dihydrofolate reductase
Name:Dihydrofolate reductase
Type:Enzyme
Mol. Mass.:21638.84
Organism:Rattus norvegicus (rat)
Description:n/a
Residue:187
BDBM18268
BDBM18044
NameBDBM18268
Synonyms:5-methyl-6-{[(3,4,5-trimethoxyphenyl)amino]methyl}quinazoline-2,4-diamine TMQ US11111252, Compound TMQ | US11530198, Example Trimetrexate
TypeSmall organic molecule
Emp. Form.C19H23N5O3
Mol. Mass.369.4176
SMILESCOc1cc(NCc2ccc3nc(N)nc(N)c3c2C)cc(OC)c1OC