Reaction Details
Target3-hydroxy-3-methylglutaryl-coenzyme A reductase
LigandBDBM18376
Substrate/CompetitorBDBM18373
Meas. Tech.HMG-CoA Reductase In Vitro Assay
pH7.2±n/a
Temperature310.15±n/a K
IC50 2.8±n/a nM
Citation Bratton, LDAuerbach, BChoi, CDillon, LHanselman, JCLarsen, SDLu, GOlsen, KPfefferkorn, JARobertson, ASekerke, CTrivedi, BKUnangst, PC Discovery of pyrrole-based hepatoselective ligands as potent inhibitors of HMG-CoA reductase. Bioorg Med Chem15:5576-89 (2007) 
 
3-hydroxy-3-methylglutaryl-coenzyme A reductase
Name:3-hydroxy-3-methylglutaryl-coenzyme A reductase
Type:Enzyme
Mol. Mass.:96689.85
Organism:Rattus norvegicus (rat)
Description:Isolated rat liver microsomes were used as enzyme source.
Residue:887
BDBM18376
BDBM18373
NameBDBM18376
Synonyms:(3R,5S,6E)-7-[4-(4-fluorophenyl)-5-(methoxymethyl)-2,6-bis(propan-2-yl)pyridin-3-yl]-3,5-dihydroxyhept-6-enoic acid cid_446156
TypeSmall organic molecule
Emp. Form.C26H34FNO5
Mol. Mass.459.5503
SMILESCOCc1c(nc(C(C)C)c(\C=C\[C@@H](O)C[C@@H](O)CC(O)=O)c1-c1ccc(F)cc1)C(C)C