Reaction Details
TargetGlucocorticoid receptor
LigandBDBM18746
Substrate/CompetitorBDBM18207
Meas. Tech.Fluorescence Polarization Competitive Binding Assay.
pH7.4±n/a
Temperature295.15±n/a K
IC50 34±n/a nM
Citation Takahashi, HBekkali, YCapolino, AJGilmore, TGoldrick, SEKaplita, PVLiu, LNelson, RMTerenzio, DWang, JZuvela-Jelaska, LProudfoot, JNabozny, GThomson, D Discovery and SAR study of novel dihydroquinoline-containing glucocorticoid receptor agonists. Bioorg Med Chem Lett17:5091-5 (2007) 
 
Glucocorticoid receptor
Name:Glucocorticoid receptor
Type:Enzyme
Mol. Mass.:85656.87
Organism:Homo sapiens (Human)
Description:P04150
Residue:777
BDBM18746
BDBM18207
NameBDBM18746
Synonyms:6-(5-fluoro-2-methoxyphenyl)-2,2-dimethyl-4-[1-(prop-2-en-1-yloxy)ethyl]-1,2-dihydroquinoline | dihydroquinoline-based ligand, 38
TypeSmall organic molecule
Emp. Form.C23H26FNO2
Mol. Mass.367.4564
SMILESCOc1ccc(F)cc1-c1ccc2NC(C)(C)C=C(C(C)OCC=C)c2c1