Reaction Details
TargetVascular endothelial growth factor receptor 2
LigandBDBM139542
Substrate/Competitorn/a
Meas. Tech.Kinase Assay
Ki 12.0±n/a nM
Citation Hull, III, CEMalone, TC Method of treating conditions with kinase inhibitors US Patent US9820989 Publication Date 11/21/2017
 
Vascular endothelial growth factor receptor 2
Name:Vascular endothelial growth factor receptor 2
Type:Receptor Tyrosine Kinase
Mol. Mass.:151510.97
Organism:Homo sapiens (Human)
Description:P35968
Residue:1356
BDBM139542
NameBDBM139542
Synonyms:US8889870, 2 US9820989, 2
TypeSmall organic molecule
Emp. Form.C23H25N5O
Mol. Mass.387.4775
SMILESCC(C)c1cccc(NC(=O)c2cccc(c2)N2CCc3nc(N)ncc3C2)c1