Reaction Details
TargetVascular endothelial growth factor receptor 2
LigandBDBM139546
Substrate/Competitorn/a
Meas. Tech.Kinase Assay
Ki 783±n/a nM
Citation Hull, III, CEMalone, TC Method of treating conditions with kinase inhibitors US Patent US9820989 Publication Date 11/21/2017
 
Vascular endothelial growth factor receptor 2
Name:Vascular endothelial growth factor receptor 2
Type:Receptor Tyrosine Kinase
Mol. Mass.:151510.97
Organism:Homo sapiens (Human)
Description:P35968
Residue:1356
BDBM139546
NameBDBM139546
Synonyms:US8889870, 6 US9820989, 6
TypeSmall organic molecule
Emp. Form.C21H21N5O
Mol. Mass.359.4243
SMILESCc1ccc(NC(=O)c2cccc(c2)N2CCc3nc(N)ncc3C2)cc1