Reaction Details
TargetVascular endothelial growth factor receptor 2
LigandBDBM139557
Substrate/Competitorn/a
Meas. Tech.Kinase Assay
Ki 307±n/a nM
Citation Hull, III, CEMalone, TC Method of treating conditions with kinase inhibitors US Patent US9820989 Publication Date 11/21/2017
 
Vascular endothelial growth factor receptor 2
Name:Vascular endothelial growth factor receptor 2
Type:Receptor Tyrosine Kinase
Mol. Mass.:151510.97
Organism:Homo sapiens (Human)
Description:P35968
Residue:1356
BDBM139557
NameBDBM139557
Synonyms:US8889870, 17 US9820989, 17
TypeSmall organic molecule
Emp. Form.C24H33N5O
Mol. Mass.407.5517
SMILESCC(C)(C)C1CCC(CC1)NC(=O)c1cccc(c1)N1CCc2nc(N)ncc2C1