Reaction Details
TargetVascular endothelial growth factor receptor 2
LigandBDBM139597
Substrate/Competitorn/a
Meas. Tech.Kinase Assay
Ki 71.0±n/a nM
Citation Hull, III, CEMalone, TC Method of treating conditions with kinase inhibitors US Patent US9820989 Publication Date 11/21/2017
 
Vascular endothelial growth factor receptor 2
Name:Vascular endothelial growth factor receptor 2
Type:Receptor Tyrosine Kinase
Mol. Mass.:151510.97
Organism:Homo sapiens (Human)
Description:P35968
Residue:1356
BDBM139597
NameBDBM139597
Synonyms:US8889870, 139 | US9820989, 139
TypeSmall organic molecule
Emp. Form.C23H21F3N4OS
Mol. Mass.458.499
SMILESCc1ccc(cc1N1CCc2nc(CS)ncc2C1)C(=O)Nc1cccc(c1)C(F)(F)F