Reaction Details
TargetVascular endothelial growth factor receptor 2
LigandBDBM139601
Substrate/Competitorn/a
Meas. Tech.Kinase Assay
Ki 8.00±n/a nM
Citation Hull, III, CEMalone, TC Method of treating conditions with kinase inhibitors US Patent US9820989 Publication Date 11/21/2017
 
Vascular endothelial growth factor receptor 2
Name:Vascular endothelial growth factor receptor 2
Type:Receptor Tyrosine Kinase
Mol. Mass.:151510.97
Organism:Homo sapiens (Human)
Description:P35968
Residue:1356
BDBM139601
NameBDBM139601
Synonyms:US8889870, 147 | US9820989, 147
TypeSmall organic molecule
Emp. Form.C22H20F3N5O
Mol. Mass.427.4223
SMILESCc1ccc(cc1N1CCc2nc(N)ncc2C1)C(=O)Nc1cccc(c1)C(F)(F)F