Reaction Details
TargetVascular endothelial growth factor receptor 2
LigandBDBM139608
Substrate/Competitorn/a
Meas. Tech.Kinase Assay
Ki 11.0±n/a nM
Citation Hull, III, CEMalone, TC Method of treating conditions with kinase inhibitors US Patent US9820989 Publication Date 11/21/2017
 
Vascular endothelial growth factor receptor 2
Name:Vascular endothelial growth factor receptor 2
Type:Receptor Tyrosine Kinase
Mol. Mass.:151510.97
Organism:Homo sapiens (Human)
Description:P35968
Residue:1356
BDBM139608
NameBDBM139608
Synonyms:US8889870, 154 US9820989, 154
TypeSmall organic molecule
Emp. Form.C24H26N4O
Mol. Mass.386.4894
SMILESCC(C)c1cccc(NC(=O)c2ccc(C)c(c2)N2CCc3ncncc3C2)c1