Reaction Details
TargetVascular endothelial growth factor receptor 2
LigandBDBM139617
Substrate/Competitorn/a
Meas. Tech.Kinase Assay
Ki>1000±n/a nM
Citation Hull, III, CEMalone, TC Method of treating conditions with kinase inhibitors US Patent US9820989 Publication Date 11/21/2017
 
Vascular endothelial growth factor receptor 2
Name:Vascular endothelial growth factor receptor 2
Type:Receptor Tyrosine Kinase
Mol. Mass.:151510.97
Organism:Homo sapiens (Human)
Description:P35968
Residue:1356
BDBM139617
NameBDBM139617
Synonyms:US8889870, 165 US9820989, 165
TypeSmall organic molecule
Emp. Form.C22H22N4O
Mol. Mass.358.4363
SMILESCc1ccc(NC(=O)Nc2ccc(cc2)N2CCc3ccncc3C2)cc1