Reaction Details
TargetVascular endothelial growth factor receptor 2
LigandBDBM139621
Substrate/Competitorn/a
Meas. Tech.Kinase Assay
Ki 12.0±n/a nM
Citation Hull, III, CEMalone, TC Method of treating conditions with kinase inhibitors US Patent US9820989 Publication Date 11/21/2017
 
Vascular endothelial growth factor receptor 2
Name:Vascular endothelial growth factor receptor 2
Type:Receptor Tyrosine Kinase
Mol. Mass.:151510.97
Organism:Homo sapiens (Human)
Description:P35968
Residue:1356
BDBM139621
NameBDBM139621
Synonyms:US8889870, 169 US9820989, 169
TypeSmall organic molecule
Emp. Form.C26H27N3O3
Mol. Mass.429.5109
SMILESCOC(=O)c1cncc2CN(CCc12)c1cccc(c1)C(=O)Nc1cccc(c1)C(C)C